Skip to Content
0
Former Member
Nov 22, 2007 at 07:48 PM

SAP Preview NW4 on openSUSE 10.2 installation failed

11 Views

Hello all,

I ma installing Technology Preview SAP NetWeaver 04 - SAP Web Application Server on Linux version openSuse 10.2 all went correct till I got error>>

The package sapj2ee-srv-sapdb-6.40-2 is already installed.

The package sapdb-7.5-2 is already installed.

The package sapdb-db-log-7.5-2 is already installed.

The package sapdb-db-files-7.5-2 is already installed.

Device eth0:0

inet used for hostname nw4host

Hostname nw4host already configured.

uname: error while loading shared libraries: libc.so.6: cannot open shared object file: No such file or directory

uname: error while loading shared libraries: libc.so.6: cannot open shared object file: No such file or directory

uname: error while loading shared libraries: libc.so.6: cannot open shared object file: No such file or directory

sed: error while loading shared libraries: libc.so.6: cannot open shared object file: No such file or directory

sed: error while loading shared libraries: libc.so.6: cannot open shared object file: No such file or directory

uname: error while loading shared libraries: libc.so.6: cannot open shared object file: No such file or directory

tty: error while loading shared libraries: libc.so.6: cannot open shared object file: No such file or directory

uname: error while loading shared libraries: libc.so.6: cannot open shared object file: No such file or directory

awk: error while loading shared libraries: libdl.so.2: cannot open shared object file: No such file or directory

rm: error while loading shared libraries: libc.so.6: cannot open shared object file: No such file or directory

/sapdb/programs/bin/xuser: error while loading shared libraries: libdl.so.2: cannot open shared object file: No such file or directory

[: error while loading shared libraries: libc.so.6: cannot open shared object file: No such file or directory

could not write db password file for nw4adm

Creation of .XUSER.62 failed.

<<end of the error>

I checked directories lib and both libraries exist and are correct link.

Can anybody outline some workaround or help on this issue, thanks

Peter