Skip to Content
avatar image
Former Member

Exception During Execute

Hi all,

I got a runtime exception which was stating as, 'EXCEPTION_DURING_EXECUTE' ..

I have even gone through many of the previous forums but unable to clinch upon a proper solution,because we are not directly handling with the maps,instead we have third party mapping(Datastage or Mercator)between the two entities..

<b>So,can anyone help me out in this issue..</b>

Im very new to XI, and if suppose i have projected the exception wrongly,please help me for rectifying myself by suggesting me..

Have a Nice Time..

Add comment
10|10000 characters needed characters exceeded

  • Get RSS Feed

2 Answers

  • Best Answer
    avatar image
    Former Member
    Aug 22, 2007 at 02:43 AM


    could you please post the complete error you are getting in sxmb_moni



    Add comment
    10|10000 characters needed characters exceeded

    • Former Member

      This is the error message displayed

      <?xml version="1.0" encoding="UTF-8" standalone="yes" ?> 
      - <!-- 
       Request Message Mapping 
      Error! Hyperlink reference not valid. <SAP:Error xmlns:SAP="" xmlns:SOAP="" SOAP:mustUnderstand=""> 
      <SAP:P3>java.lang.RuntimeException: Map: map /data/DSPXD/~</SAP:P3> 
      <SAP:P4 /> 
      <SAP:AdditionalText /> 
      <SAP:ApplicationFaultMessage namespace="" /> 
      <SAP:Stack>During the application mapping com/philips/pbas/xi/datastage/XICallDatastage a java.lang.RuntimeException was thrown: java.lang.RuntimeException: Map: map /data/DSPXD/~</SAP:Stack> 

      when the trace is opened and the root cause was found the following was found

      <b>Root Cause: java.lang.RuntimeException: java.lang.RuntimeException: Map: map /data/DSPXD/data/maps/PXD/IF007BN1.A81 failed: </b>One or more inputs was invalid at at Code)) 

      we have not made any mappings and they were made by another project . we use a java mapp to call those mappings.

  • Aug 22, 2007 at 03:04 AM


    Post your complete error ?



    Add comment
    10|10000 characters needed characters exceeded