Skip to Content

Fiori Client Customization Build Error -Android

Hello All,

I am creating our own Fiori client through SAP SMP SDK 3.13.6 by referencing the help document

Fiori Client Customization :https://help.sap.com/doc/38ec5403bfbf4d7a8fdd3fee5f9605e0/3.0.14/en-US/ba869783a38240528b3dc2c6c194e747.html.

But at the step when I build the application with "cordova build android/run android /compile android " I get the build error . which I have pasted below the build Error . Sorry I couldnt attach it .

I have tried to remove the "cross walk plugin" from custom fiori client plugin older "C:\SAP\MobileSDK3\KapselSDK\apps\fiori_client\<custom fiori client>\plugins "

Also removed the reference of cross walk plugin in "config.xml" in C:\SAP\MobileSDK3\KapselSDK\apps\fiori_client\<custom fiori client>

. Still it didn't work . Need your suggestion to proceed further .

Below are the details of my configuration and installation details .

JDK :1.8.0_65

SAP Mobile SDK version : 3.13.6

Android SDK plugin : 2.2.3 and Gradle version : 2.14.1

GIT 2.1.1

Cordova Version : 6.1.1

NPM version : 3.3.12 node 5.4.1

System Variable :http_proxyActual proxy with porthttps_proxyActual proxy with portJAVA_HOMEC:\Program Files\Java\jdk1.8.0_65PATH %JAVA_HOME%\bin;C:\ProgramData\Oracle\Java\javapath;C:\Program Files\CyberSafe\bin;C:\Program Files (x86)\CyberSafe\bin;%SystemRoot%\system32;%SystemRoot%;%SystemRoot%\System32\Wbem;%SYSTEMROOT%\System32\WindowsPowerShell\v1.0\;%systemroot%\System32\WindowsPowerShell\v1.0\;C:\Program Files\Microsoft Windows Performance Toolkit\;C:\FTRL;C:\Program Files (x86)\SAP\Archlink;C:\Program Files\nodejs\;C:\Program Files\Java\jdk1.8.0_65\bin;C:\Program Files\Java\jdk1.8.0_65\lib;C:\Program Files\Java\jdk1.8.0_65\jre\lib;C:\Program Files\Java\jdk1.8.0_65\jre\bin\server;C:\SAP\AndroidSDK\platform-tools;C:\SAP\AndroidSDK\tools;C:\Program Files\Git\cmd;%ANT_HOME%\bin;

Below is the error :

{\rtf1\ansi\ansicpg1252\deff0\deflang16393{\fonttbl{\f0\fnil\fcharset0 Calibri;}} {\*\generator Msftedit 5.41.21.2510;}\viewkind4\uc1\pard\sa200\sl276\slmult1\lang9\f0\fs22 C:\\SAP\\MobileSDK3\\KapselSDK\\apps\\fiori_client\\volvoclientfld>cordova compile android\par ANDROID_HOME=C:\\SAP\\AndroidSDK\par JAVA_HOME=C:\\Program Files\\Java\\jdk1.8.0_65\par :preBuild UP-TO-DATE\par :preDebugBuild UP-TO-DATE\par :checkDebugManifest\par :preReleaseBuild UP-TO-DATE\par :CordovaLib:preBuild UP-TO-DATE\par :CordovaLib:preDebugBuild UP-TO-DATE\par :CordovaLib:compileDebugNdk UP-TO-DATE\par :CordovaLib:compileLint\par :CordovaLib:copyDebugLint UP-TO-DATE\par :CordovaLib:mergeDebugProguardFiles UP-TO-DATE\par :CordovaLib:packageDebugRenderscript UP-TO-DATE\par :CordovaLib:checkDebugManifest\par :CordovaLib:prepareDebugDependencies\par :CordovaLib:compileDebugRenderscript UP-TO-DATE\par :CordovaLib:generateDebugResValues UP-TO-DATE\par :CordovaLib:generateDebugResources UP-TO-DATE\par :CordovaLib:packageDebugResources UP-TO-DATE\par :CordovaLib:compileDebugAidl UP-TO-DATE\par :CordovaLib:generateDebugBuildConfig UP-TO-DATE\par :CordovaLib:generateDebugAssets UP-TO-DATE\par :CordovaLib:mergeDebugAssets UP-TO-DATE\par :CordovaLib:processDebugManifest UP-TO-DATE\par :CordovaLib:processDebugResources UP-TO-DATE\par :CordovaLib:generateDebugSources UP-TO-DATE\par :CordovaLib:compileDebugAspectj\par :CordovaLib:compileDebugJavaWithJavac\par :CordovaLib:processDebugJavaRes UP-TO-DATE\par :CordovaLib:transformResourcesWithMergeJavaResForDebug UP-TO-DATE\par :CordovaLib:transformClassesAndResourcesWithSyncLibJarsForDebug UP-TO-DATE\par :CordovaLib:mergeDebugJniLibFolders UP-TO-DATE\par :CordovaLib:transformNative_libsWithMergeJniLibsForDebug UP-TO-DATE\par :CordovaLib:transformNative_libsWithSyncJniLibsForDebug UP-TO-DATE\par :CordovaLib:bundleDebug UP-TO-DATE\par :CordovaLib:preReleaseBuild UP-TO-DATE\par :CordovaLib:compileReleaseNdk UP-TO-DATE\par :CordovaLib:copyReleaseLint UP-TO-DATE\par :CordovaLib:mergeReleaseProguardFiles UP-TO-DATE\par :CordovaLib:packageReleaseRenderscript UP-TO-DATE\par :CordovaLib:checkReleaseManifest\par :CordovaLib:prepareReleaseDependencies\par :CordovaLib:compileReleaseRenderscript UP-TO-DATE\par :CordovaLib:generateReleaseResValues UP-TO-DATE\par :CordovaLib:generateReleaseResources UP-TO-DATE\par :CordovaLib:packageReleaseResources UP-TO-DATE\par :CordovaLib:compileReleaseAidl UP-TO-DATE\par :CordovaLib:generateReleaseBuildConfig UP-TO-DATE\par :CordovaLib:generateReleaseAssets UP-TO-DATE\par :CordovaLib:mergeReleaseAssets UP-TO-DATE\par :CordovaLib:processReleaseManifest UP-TO-DATE\par :CordovaLib:processReleaseResources UP-TO-DATE\par :CordovaLib:generateReleaseSources UP-TO-DATE\par :CordovaLib:compileReleaseAspectj\par :CordovaLib:compileReleaseJavaWithJavac\par :CordovaLib:processReleaseJavaRes UP-TO-DATE\par :CordovaLib:transformResourcesWithMergeJavaResForRelease UP-TO-DATE\par :CordovaLib:transformClassesAndResourcesWithSyncLibJarsForRelease UP-TO-DATE\par :CordovaLib:mergeReleaseJniLibFolders UP-TO-DATE\par :CordovaLib:transformNative_libsWithMergeJniLibsForRelease UP-TO-DATE\par :CordovaLib:transformNative_libsWithSyncJniLibsForRelease UP-TO-DATE\par :CordovaLib:bundleRelease UP-TO-DATE\par :prepareAfariaProvider3136Library UP-TO-DATE\par :prepareAndroidCordovaLibUnspecifiedDebugLibrary UP-TO-DATE\par :prepareAuthproxyAndroid3136Library UP-TO-DATE\par :prepareBarcodescannerAndroid3136Library UP-TO-DATE\par :prepareCDSProvider3136Library UP-TO-DATE\par :preDebugAndroidTestBuild UP-TO-DATE\par :prepareComAndroidSupportMultidex101Library UP-TO-DATE\par :prepareComAndroidSupportSupportV42310Library UP-TO-DATE\par :prepareComGoogleAndroidGmsPlayServicesBase730Library UP-TO-DATE\par :prepareComGoogleAndroidGmsPlayServicesGcm730Library UP-TO-DATE\par :prepareFederation3136Library UP-TO-DATE\par :prepareFederationProvider3136Library UP-TO-DATE\par :prepareJdeferredAndroidAar124Library UP-TO-DATE\par :prepareMaflogoncorecdvplugin3136Library UP-TO-DATE\par :prepareToolbarAndroid3136Library UP-TO-DATE\par :prepareVoicerecordingAndroid3136Library UP-TO-DATE\par :prepareDebugDependencies\par :compileDebugAidl UP-TO-DATE\par :compileDebugRenderscript UP-TO-DATE\par :generateDebugBuildConfig UP-TO-DATE\par :generateDebugAssets UP-TO-DATE\par :mergeDebugAssets\par :generateDebugResValues UP-TO-DATE\par :generateDebugResources UP-TO-DATE\par :mergeDebugResources UP-TO-DATE\par :processDebugManifest UP-TO-DATE\par :processDebugResources\par :generateDebugSources\par :compileDebugJavaWithJavacC:\\SAP\\MobileSDK3\\KapselSDK\\apps\\fiori_client\\volvoclientfld\\platforms\\and\par roid\\src\\com\\sap\\kapsel\\inappbrowser\\XWalkInAppBrowser.java:56: error: package org.crosswalk.engine\par does not exist\par import org.crosswalk.engine.XWalkCordovaClientCertRequest;\par ^\par C:\\SAP\\MobileSDK3\\KapselSDK\\apps\\fiori_client\\volvoclientfld\\platforms\\android\\src\\com\\sap\\kapsel\\in\par appbrowser\\XWalkInAppBrowser.java:57: error: package org.crosswalk.engine does not exist\par import org.crosswalk.engine.XWalkCordovaHttpAuthHandler;\par ^\par C:\\SAP\\MobileSDK3\\KapselSDK\\apps\\fiori_client\\volvoclientfld\\platforms\\android\\src\\com\\sap\\kapsel\\in\par appbrowser\\XWalkInAppBrowser.java:60: error: package org.xwalk.core does not exist\par import org.xwalk.core.ClientCertRequest;\par ^\par C:\\SAP\\MobileSDK3\\KapselSDK\\apps\\fiori_client\\volvoclientfld\\platforms\\android\\src\\com\\sap\\kapsel\\in\par appbrowser\\XWalkInAppBrowser.java:61: error: package org.xwalk.core does not exist\par import org.xwalk.core.XWalkDownloadListener;\par ^\par C:\\SAP\\MobileSDK3\\KapselSDK\\apps\\fiori_client\\volvoclientfld\\platforms\\android\\src\\com\\sap\\kapsel\\in\par appbrowser\\XWalkInAppBrowser.java:62: error: package org.xwalk.core does not exist\par import org.xwalk.core.XWalkHttpAuthHandler;\par ^\par C:\\SAP\\MobileSDK3\\KapselSDK\\apps\\fiori_client\\volvoclientfld\\platforms\\android\\src\\com\\sap\\kapsel\\in\par appbrowser\\XWalkInAppBrowser.java:63: error: package org.xwalk.core does not exist\par import org.xwalk.core.XWalkNavigationHistory;\par ^\par C:\\SAP\\MobileSDK3\\KapselSDK\\apps\\fiori_client\\volvoclientfld\\platforms\\android\\src\\com\\sap\\kapsel\\in\par appbrowser\\XWalkInAppBrowser.java:64: error: package org.xwalk.core does not exist\par import org.xwalk.core.XWalkResourceClient;\par ^\par C:\\SAP\\MobileSDK3\\KapselSDK\\apps\\fiori_client\\volvoclientfld\\platforms\\android\\src\\com\\sap\\kapsel\\in\par appbrowser\\XWalkInAppBrowser.java:65: error: package org.xwalk.core does not exist\par import org.xwalk.core.XWalkUIClient;\par ^\par C:\\SAP\\MobileSDK3\\KapselSDK\\apps\\fiori_client\\volvoclientfld\\platforms\\android\\src\\com\\sap\\kapsel\\in\par appbrowser\\XWalkInAppBrowser.java:66: error: package org.xwalk.core does not exist\par import org.xwalk.core.XWalkView;\par ^\par C:\\SAP\\MobileSDK3\\KapselSDK\\apps\\fiori_client\\volvoclientfld\\platforms\\android\\src\\com\\sap\\kapsel\\in\par appbrowser\\XWalkInAppBrowser.java:67: error: package org.xwalk.core does not exist\par import org.xwalk.core.XWalkCookieManager;\par ^\par C:\\SAP\\MobileSDK3\\KapselSDK\\apps\\fiori_client\\volvoclientfld\\platforms\\android\\src\\com\\sap\\kapsel\\in\par appbrowser\\XWalkInAppBrowser.java:89: error: cannot find symbol\par private XWalkView inAppWebView;\par ^\par symbol: class XWalkView\par location: class XWalkInAppBrowser\par C:\\SAP\\MobileSDK3\\KapselSDK\\apps\\fiori_client\\volvoclientfld\\platforms\\android\\src\\com\\sap\\kapsel\\in\par appbrowser\\XWalkInAppBrowser.java:777: error: cannot find symbol\par public class XWalkInAppBrowserClient extends XWalkResourceClient \{\par ^\par symbol: class XWalkResourceClient\par location: class XWalkInAppBrowser\par C:\\SAP\\MobileSDK3\\KapselSDK\\apps\\fiori_client\\volvoclientfld\\platforms\\android\\src\\com\\sap\\kapsel\\in\par appbrowser\\XWalkInAppBrowser.java:788: error: cannot find symbol\par public XWalkInAppBrowserClient(XWalkView view, CordovaWebView webView, EditText mEditText) \{\par \par ^\par symbol: class XWalkView\par location: class XWalkInAppBrowser.XWalkInAppBrowserClient\par C:\\SAP\\MobileSDK3\\KapselSDK\\apps\\fiori_client\\volvoclientfld\\platforms\\android\\src\\com\\sap\\kapsel\\in\par appbrowser\\XWalkInAppBrowser.java:795: error: cannot find symbol\par public void onReceivedLoadError(XWalkView view, int errorCode, String description, String fa\par ilingUrl) \{\par ^\par symbol: class XWalkView\par location: class XWalkInAppBrowser.XWalkInAppBrowserClient\par C:\\SAP\\MobileSDK3\\KapselSDK\\apps\\fiori_client\\volvoclientfld\\platforms\\android\\src\\com\\sap\\kapsel\\in\par appbrowser\\XWalkInAppBrowser.java:812: error: cannot find symbol\par public void onReceivedHttpAuthRequest(XWalkView view, XWalkHttpAuthHandler handler,\par ^\par symbol: class XWalkView\par location: class XWalkInAppBrowser.XWalkInAppBrowserClient\par C:\\SAP\\MobileSDK3\\KapselSDK\\apps\\fiori_client\\volvoclientfld\\platforms\\android\\src\\com\\sap\\kapsel\\in\par appbrowser\\XWalkInAppBrowser.java:812: error: cannot find symbol\par public void onReceivedHttpAuthRequest(XWalkView view, XWalkHttpAuthHandler handler,\par ^\par symbol: class XWalkHttpAuthHandler\par location: class XWalkInAppBrowser.XWalkInAppBrowserClient\par C:\\SAP\\MobileSDK3\\KapselSDK\\apps\\fiori_client\\volvoclientfld\\platforms\\android\\src\\com\\sap\\kapsel\\in\par appbrowser\\XWalkInAppBrowser.java:825: error: cannot find symbol\par public void onReceivedClientCertRequest(XWalkView view, ClientCertRequest request) \{\par ^\par symbol: class XWalkView\par location: class XWalkInAppBrowser.XWalkInAppBrowserClient\par C:\\SAP\\MobileSDK3\\KapselSDK\\apps\\fiori_client\\volvoclientfld\\platforms\\android\\src\\com\\sap\\kapsel\\in\par appbrowser\\XWalkInAppBrowser.java:825: error: cannot find symbol\par public void onReceivedClientCertRequest(XWalkView view, ClientCertRequest request) \{\par ^\par symbol: class ClientCertRequest\par location: class XWalkInAppBrowser.XWalkInAppBrowserClient\par C:\\SAP\\MobileSDK3\\KapselSDK\\apps\\fiori_client\\volvoclientfld\\platforms\\android\\src\\com\\sap\\kapsel\\in\par appbrowser\\XWalkInAppUIClient.java:8: error: package org.xwalk.core does not exist\par import org.xwalk.core.XWalkJavascriptResult;\par ^\par C:\\SAP\\MobileSDK3\\KapselSDK\\apps\\fiori_client\\volvoclientfld\\platforms\\android\\src\\com\\sap\\kapsel\\in\par appbrowser\\XWalkInAppUIClient.java:9: error: package org.xwalk.core does not exist\par import org.xwalk.core.XWalkUIClient;\par ^\par C:\\SAP\\MobileSDK3\\KapselSDK\\apps\\fiori_client\\volvoclientfld\\platforms\\android\\src\\com\\sap\\kapsel\\in\par appbrowser\\XWalkInAppUIClient.java:10: error: package org.xwalk.core does not exist\par import org.xwalk.core.XWalkView;\par ^\par C:\\SAP\\MobileSDK3\\KapselSDK\\apps\\fiori_client\\volvoclientfld\\platforms\\android\\src\\com\\sap\\kapsel\\in\par appbrowser\\XWalkInAppUIClient.java:12: error: cannot find symbol\par public class XWalkInAppUIClient extends XWalkUIClient \{\par ^\par symbol: class XWalkUIClient\par C:\\SAP\\MobileSDK3\\KapselSDK\\apps\\fiori_client\\volvoclientfld\\platforms\\android\\src\\com\\sap\\kapsel\\in\par appbrowser\\XWalkInAppUIClient.java:18: error: cannot find symbol\par public XWalkInAppUIClient(XWalkView view, CordovaWebView webView) \{\par ^\par symbol: class XWalkView\par location: class XWalkInAppUIClient\par C:\\SAP\\MobileSDK3\\KapselSDK\\apps\\fiori_client\\volvoclientfld\\platforms\\android\\src\\com\\sap\\kapsel\\in\par appbrowser\\XWalkInAppUIClient.java:50: error: cannot find symbol\par public boolean onJavascriptModalDialog (XWalkView view, JavascriptMessageType type, String url,\par String message, String defaultValue, XWalkJavascriptResult result) \{\par ^\par symbol: class XWalkView\par location: class XWalkInAppUIClient\par C:\\SAP\\MobileSDK3\\KapselSDK\\apps\\fiori_client\\volvoclientfld\\platforms\\android\\src\\com\\sap\\kapsel\\in\par appbrowser\\XWalkInAppUIClient.java:50: error: cannot find symbol\par public boolean onJavascriptModalDialog (XWalkView view, JavascriptMessageType type, String url,\par String message, String defaultValue, XWalkJavascriptResult result) \{\par ^\par symbol: class JavascriptMessageType\par location: class XWalkInAppUIClient\par C:\\SAP\\MobileSDK3\\KapselSDK\\apps\\fiori_client\\volvoclientfld\\platforms\\android\\src\\com\\sap\\kapsel\\in\par appbrowser\\XWalkInAppUIClient.java:50: error: cannot find symbol\par public boolean onJavascriptModalDialog (XWalkView view, JavascriptMessageType type, String url,\par String message, String defaultValue, XWalkJavascriptResult result) \{\par \par ^\par symbol: class XWalkJavascriptResult\par location: class XWalkInAppUIClient\par C:\\SAP\\MobileSDK3\\KapselSDK\\apps\\fiori_client\\volvoclientfld\\platforms\\android\\src\\com\\sap\\kapsel\\in\par appbrowser\\XWalkInAppBrowser.java:245: error: cannot find symbol\par final XWalkView childView = this.inAppWebView;\par ^\par symbol: class XWalkView\par location: class XWalkInAppBrowser\par C:\\SAP\\MobileSDK3\\KapselSDK\\apps\\fiori_client\\volvoclientfld\\platforms\\android\\src\\com\\sap\\kapsel\\in\par appbrowser\\XWalkInAppBrowser.java:254: error: cannot find symbol\par childView.setResourceClient(new XWalkResourceClient(childView) \{\par ^\par symbol: class XWalkResourceClient\par C:\\SAP\\MobileSDK3\\KapselSDK\\apps\\fiori_client\\volvoclientfld\\platforms\\android\\src\\com\\sap\\kapsel\\in\par appbrowser\\XWalkInAppBrowser.java:284: error: package XWalkNavigationHistory does not exist\par this.inAppWebView.getNavigationHistory().navigate(XWalkNavigationHistory.Direction.BACKW\par ARD, 1);\par ^\par C:\\SAP\\MobileSDK3\\KapselSDK\\apps\\fiori_client\\volvoclientfld\\platforms\\android\\src\\com\\sap\\kapsel\\in\par appbrowser\\XWalkInAppBrowser.java:309: error: package XWalkNavigationHistory does not exist\par this.inAppWebView.getNavigationHistory().navigate(XWalkNavigationHistory.Direction.FORWA\par RD, 1);\par ^\par C:\\SAP\\MobileSDK3\\KapselSDK\\apps\\fiori_client\\volvoclientfld\\platforms\\android\\src\\com\\sap\\kapsel\\in\par appbrowser\\XWalkInAppBrowser.java:567: error: cannot find symbol\par inAppWebView = new XWalkView(cordova.getActivity(), cordova.getActivity());\par ^\par symbol: class XWalkView\par C:\\SAP\\MobileSDK3\\KapselSDK\\apps\\fiori_client\\volvoclientfld\\platforms\\android\\src\\com\\sap\\kapsel\\in\par appbrowser\\XWalkInAppBrowser.java:573: error: cannot find symbol\par inAppWebView.setDownloadListener(new XWalkDownloadListener(cordova.getActivity()\par ) \{\par ^\par symbol: class XWalkDownloadListener\par C:\\SAP\\MobileSDK3\\KapselSDK\\apps\\fiori_client\\volvoclientfld\\platforms\\android\\src\\com\\sap\\kapsel\\in\par appbrowser\\XWalkInAppBrowser.java:606: error: cannot find symbol\par public void onPageLoadStarted(XWalkView view, String url) \{\par ^\par symbol: class XWalkView\par C:\\SAP\\MobileSDK3\\KapselSDK\\apps\\fiori_client\\volvoclientfld\\platforms\\android\\src\\com\\sap\\kapsel\\in\par appbrowser\\XWalkInAppBrowser.java:683: error: cannot find symbol\par public void onPageLoadStopped(XWalkView view, String url, XWalkUIClient.LoadStat\par us status) \{\par ^\par symbol: class XWalkView\par C:\\SAP\\MobileSDK3\\KapselSDK\\apps\\fiori_client\\volvoclientfld\\platforms\\android\\src\\com\\sap\\kapsel\\in\par appbrowser\\XWalkInAppBrowser.java:683: error: package XWalkUIClient does not exist\par public void onPageLoadStopped(XWalkView view, String url, XWalkUIClient.LoadStat\par us status) \{\par ^\par C:\\SAP\\MobileSDK3\\KapselSDK\\apps\\fiori_client\\volvoclientfld\\platforms\\android\\src\\com\\sap\\kapsel\\in\par appbrowser\\XWalkInAppUIClient.java:49: error: method does not override or implement a method from a\par supertype\par @Override\par ^\par C:\\SAP\\MobileSDK3\\KapselSDK\\apps\\fiori_client\\volvoclientfld\\platforms\\android\\src\\com\\sap\\kapsel\\in\par appbrowser\\XWalkInAppUIClient.java:52: error: cannot find symbol\par if (type == JavascriptMessageType.JAVASCRIPT_PROMPT) \{\par ^\par symbol: variable JavascriptMessageType\par location: class XWalkInAppUIClient\par C:\\SAP\\MobileSDK3\\KapselSDK\\apps\\fiori_client\\volvoclientfld\\platforms\\android\\src\\com\\sap\\kapsel\\in\par appbrowser\\XWalkInAppUIClient.java:82: error: cannot find symbol\par return super.onJavascriptModalDialog(view, type, url, message, defaultValue, result);\par ^\par symbol: variable super\par location: class XWalkInAppUIClient\par C:\\SAP\\MobileSDK3\\KapselSDK\\apps\\fiori_client\\volvoclientfld\\platforms\\android\\src\\com\\sap\\kapsel\\in\par appbrowser\\XWalkInAppBrowser.java:698: error: cannot find symbol\par XWalkResourceClient client = new XWalkInAppBrowserClient(inAppWebView, thatWebView,\par edittext);\par ^\par symbol: class XWalkResourceClient\par C:\\SAP\\MobileSDK3\\KapselSDK\\apps\\fiori_client\\volvoclientfld\\platforms\\android\\src\\com\\sap\\kapsel\\in\par appbrowser\\XWalkInAppBrowser.java:702: error: cannot find symbol\par XWalkCookieManager cookieManager = new XWalkCookieManager();\par ^\par symbol: class XWalkCookieManager\par C:\\SAP\\MobileSDK3\\KapselSDK\\apps\\fiori_client\\volvoclientfld\\platforms\\android\\src\\com\\sap\\kapsel\\in\par appbrowser\\XWalkInAppBrowser.java:702: error: cannot find symbol\par XWalkCookieManager cookieManager = new XWalkCookieManager();\par ^\par symbol: class XWalkCookieManager\par C:\\SAP\\MobileSDK3\\KapselSDK\\apps\\fiori_client\\volvoclientfld\\platforms\\android\\src\\com\\sap\\kapsel\\in\par appbrowser\\XWalkInAppBrowser.java:705: error: cannot find symbol\par XWalkCookieManager cookieManager = new XWalkCookieManager();\par ^\par symbol: class XWalkCookieManager\par C:\\SAP\\MobileSDK3\\KapselSDK\\apps\\fiori_client\\volvoclientfld\\platforms\\android\\src\\com\\sap\\kapsel\\in\par appbrowser\\XWalkInAppBrowser.java:705: error: cannot find symbol\par XWalkCookieManager cookieManager = new XWalkCookieManager();\par ^\par symbol: class XWalkCookieManager\par C:\\SAP\\MobileSDK3\\KapselSDK\\apps\\fiori_client\\volvoclientfld\\platforms\\android\\src\\com\\sap\\kapsel\\in\par appbrowser\\XWalkInAppBrowser.java:794: error: method does not override or implement a method from a\par supertype\par @Override\par ^\par C:\\SAP\\MobileSDK3\\KapselSDK\\apps\\fiori_client\\volvoclientfld\\platforms\\android\\src\\com\\sap\\kapsel\\in\par appbrowser\\XWalkInAppBrowser.java:811: error: method does not override or implement a method from a\par supertype\par @Override\par ^\par C:\\SAP\\MobileSDK3\\KapselSDK\\apps\\fiori_client\\volvoclientfld\\platforms\\android\\src\\com\\sap\\kapsel\\in\par appbrowser\\XWalkInAppBrowser.java:816: error: cannot find symbol\par if (pluginManager != null && pluginManager.onReceivedHttpAuthRequest(webView, new XWalkC\par ordovaHttpAuthHandler(handler), host, realm)) \{\par ^\par symbol: class XWalkCordovaHttpAuthHandler\par location: class XWalkInAppBrowser.XWalkInAppBrowserClient\par C:\\SAP\\MobileSDK3\\KapselSDK\\apps\\fiori_client\\volvoclientfld\\platforms\\android\\src\\com\\sap\\kapsel\\in\par appbrowser\\XWalkInAppBrowser.java:824: error: method does not override or implement a method from a\par supertype\par @Override\par ^\par C:\\SAP\\MobileSDK3\\KapselSDK\\apps\\fiori_client\\volvoclientfld\\platforms\\android\\src\\com\\sap\\kapsel\\in\par appbrowser\\XWalkInAppBrowser.java:828: error: cannot find symbol\par if (pluginManager != null && pluginManager.onReceivedClientCertRequest(webView, new XWal\par kCordovaClientCertRequest(request))) \{\par ^\par symbol: class XWalkCordovaClientCertRequest\par location: class XWalkInAppBrowser.XWalkInAppBrowserClient\par Note: Some input files use or override a deprecated API.\par Note: Recompile with -Xlint:deprecation for details.\par Note: C:\\SAP\\MobileSDK3\\KapselSDK\\apps\\fiori_client\\volvoclientfld\\platforms\\android\\src\\org\\apache\\\par cordova\\file\\AssetFilesystem.java uses unchecked or unsafe operations.\par Note: Recompile with -Xlint:unchecked for details.\par 48 errors\par \par FAILURE: Build failed with an exception.\par \par * What went wrong:\par Execution failed for task ':compileDebugJavaWithJavac'.\par > Compilation failed; see the compiler error output for details.\par \par * Try:\par Run with --stacktrace option to get the stack trace. Run with --info or --debug option to get more l\par og output.\par FAILED\par \par BUILD FAILED\par \par Total time: 45.173 secs\par Error: Error code 1 for command: cmd with args: /s,/c,"C:\\SAP\\MobileSDK3\\KapselSDK\\apps\\fiori_client\par \\volvoclientfld\\platforms\\android\\gradlew cdvBuildDebug -b C:\\SAP\\MobileSDK3\\KapselSDK\\apps\\fiori_cl\par ient\\volvoclientfld\\platforms\\android\\build.gradle -Dorg.gradle.daemon=true -Pandroid.useDeprecatedN\par dk=true"\par }

Add comment
10|10000 characters needed characters exceeded

  • Get RSS Feed

4 Answers

  • Apr 23, 2017 at 01:17 PM
    User Variable ANDROID_HOME C:\SAP\AndroidSDK ANT_HOME C:\SAP\apache-ant-1.9.7 JAVA_HOME C:\Program Files\Java\jdk1.8.0_65 KAPSEL_HOME C:\SAP\MobileSDK3\KapselSDK System Variable : http_proxy Actual proxy with port https_proxy Actual proxy with portl JAVA_HOME C:\Program Files\Java\jdk1.8.0_65 PATH %JAVA_HOME%\bin;C:\ProgramData\Oracle\Java\javapath;C:\Program Files\CyberSafe\bin;C:\Program Files
    (x86)\CyberSafe\bin;%SystemRoot%\system32;%SystemRoot%;%SystemRoot%\System32\Wbem;%SYSTEMROOT%\System32\WindowsPowerShell\v1.0\;%systemroot%\System32\WindowsPowerShell\v1.0\;C:\Program Files\Microsoft Windows Performance Toolkit\;C:\FTRL;C:\Program Files (x86)\SAP\Archlink;C:\Program Files\nodejs\;C:\Program Files\Java\jdk1.8.0_65\bin;C:\Program Files\Java\jdk1.8.0_65\lib;C:\Program Files\Java\jdk1.8.0_65\jre\lib;C:\Program Files\Java\jdk1.8.0_65\jre\bin\server;C:\SAP\AndroidSDK\platform-tools;C:\SAP\AndroidSDK\tools;C:\Program Files\Git\cmd;%ANT_HOME%\bin;

    Add comment
    10|10000 characters needed characters exceeded

  • Apr 23, 2017 at 01:17 PM
    User Variable ANDROID_HOME C:\SAP\AndroidSDK ANT_HOME C:\SAP\apache-ant-1.9.7 JAVA_HOME C:\Program Files\Java\jdk1.8.0_65 KAPSEL_HOME C:\SAP\MobileSDK3\KapselSDK System Variable : http_proxy Actual proxy with port https_proxy Actual proxy with portl JAVA_HOME C:\Program Files\Java\jdk1.8.0_65 PATH %JAVA_HOME%\bin;C:\ProgramData\Oracle\Java\javapath;C:\Program Files\CyberSafe\bin;C:\Program Files
    (x86)\CyberSafe\bin;%SystemRoot%\system32;%SystemRoot%;%SystemRoot%\System32\Wbem;%SYSTEMROOT%\System32\WindowsPowerShell\v1.0\;%systemroot%\System32\WindowsPowerShell\v1.0\;C:\Program Files\Microsoft Windows Performance Toolkit\;C:\FTRL;C:\Program Files (x86)\SAP\Archlink;C:\Program Files\nodejs\;C:\Program Files\Java\jdk1.8.0_65\bin;C:\Program Files\Java\jdk1.8.0_65\lib;C:\Program Files\Java\jdk1.8.0_65\jre\lib;C:\Program Files\Java\jdk1.8.0_65\jre\bin\server;C:\SAP\AndroidSDK\platform-tools;C:\SAP\AndroidSDK\tools;C:\Program Files\Git\cmd;%ANT_HOME%\bin;

    Add comment
    10|10000 characters needed characters exceeded

  • Apr 23, 2017 at 01:18 PM
    User Variable ANDROID_HOME C:\SAP\AndroidSDK ANT_HOME C:\SAP\apache-ant-1.9.7 JAVA_HOME C:\Program Files\Java\jdk1.8.0_65 KAPSEL_HOME C:\SAP\MobileSDK3\KapselSDK System Variable : http_proxy Actual proxy with port https_proxy Actual proxy with portl JAVA_HOME C:\Program Files\Java\jdk1.8.0_65 PATH %JAVA_HOME%\bin;C:\ProgramData\Oracle\Java\javapath;C:\Program Files\CyberSafe\bin;C:\Program Files
    (x86)\CyberSafe\bin;%SystemRoot%\system32;%SystemRoot%;%SystemRoot%\System32\Wbem;%SYSTEMROOT%\System32\WindowsPowerShell\v1.0\;%systemroot%\System32\WindowsPowerShell\v1.0\;C:\Program Files\Microsoft Windows Performance Toolkit\;C:\FTRL;C:\Program Files (x86)\SAP\Archlink;C:\Program Files\nodejs\;C:\Program Files\Java\jdk1.8.0_65\bin;C:\Program Files\Java\jdk1.8.0_65\lib;C:\Program Files\Java\jdk1.8.0_65\jre\lib;C:\Program Files\Java\jdk1.8.0_65\jre\bin\server;C:\SAP\AndroidSDK\platform-tools;C:\SAP\AndroidSDK\tools;C:\Program Files\Git\cmd;%ANT_HOME%\bin;

    Add comment
    10|10000 characters needed characters exceeded

  • Apr 23, 2017 at 01:18 PM
    User Variable ANDROID_HOME C:\SAP\AndroidSDK ANT_HOME C:\SAP\apache-ant-1.9.7 JAVA_HOME C:\Program Files\Java\jdk1.8.0_65 KAPSEL_HOME C:\SAP\MobileSDK3\KapselSDK System Variable : http_proxy Actual proxy with port https_proxy Actual proxy with portl JAVA_HOME C:\Program Files\Java\jdk1.8.0_65 PATH %JAVA_HOME%\bin;C:\ProgramData\Oracle\Java\javapath;C:\Program Files\CyberSafe\bin;C:\Program Files
    (x86)\CyberSafe\bin;%SystemRoot%\system32;%SystemRoot%;%SystemRoot%\System32\Wbem;%SYSTEMROOT%\System32\WindowsPowerShell\v1.0\;%systemroot%\System32\WindowsPowerShell\v1.0\;C:\Program Files\Microsoft Windows Performance Toolkit\;C:\FTRL;C:\Program Files (x86)\SAP\Archlink;C:\Program Files\nodejs\;C:\Program Files\Java\jdk1.8.0_65\bin;C:\Program Files\Java\jdk1.8.0_65\lib;C:\Program Files\Java\jdk1.8.0_65\jre\lib;C:\Program Files\Java\jdk1.8.0_65\jre\bin\server;C:\SAP\AndroidSDK\platform-tools;C:\SAP\AndroidSDK\tools;C:\Program Files\Git\cmd;%ANT_HOME%\bin;

    Add comment
    10|10000 characters needed characters exceeded