Skip to Content

While Installing 2005 recipes I'm getting errors.

I have created a cx_for_spa recipe by making a copy of the cx recipe and uncommenting for spartacussampledataaddon extensions.

Following commands, I have used
1. install.bat -r cx_for_spa setup ------ run successfully

2.install.bat -r cx_for_spa initialize ----gives an error


> Task :recipes:cx_for_spa:buildSystem FAILED FAILURE: Build failed with an exception. * Where: Build file 'D:\SAP_Spartacus\SAP_2005\installer\recipes\cx_for_spa\build.gradle' line: 593 * What went wrong: Execution failed for task ':recipes:cx_for_spa:buildSystem'. > external process returned non-zero exit code, command: [cmd, /c, set "ANT_OPTS=-Xmx1024m -Dfile.encoding=UTF-8" & set "PLATFORM_HOME=D:\SAP_Spartacus\SAP_2005\hybris\bin\platform" & set "ANT_HOME=D:\SAP_Spartacus\SAP_2005\hybris\bin\platform\apache-ant" & set "PATH=D:\SAP_Spartacus\SAP_2005\hybris\bin\platform\apache-ant\bin;%PATH%" & ant clean all] * Try: Run with --stacktrace option to get the stack trace. Run with --info or --debug option to get more log output. Run with --scan to get full insights. * Get more help at https://help.gradle.org BUILD FAILED in 3m 31s 3 actionable tasks: 3 executed Problem with java process - finished with non-zero exit code (1)


I have attached build.gradle file for reference
build-gradle.txt

build-gradle.txt (26.1 kB)
Add a comment
10|10000 characters needed characters exceeded

  • I am Using java version "11.0.7" 2020-04-14 LTS


    Stack trace
    D:\SAP_Spartacus\SAP_2005\hybris\bin\modules\platform\groovynature\buildcallbacks.xml:33: BUG! exception in phase 'semantic analysis' in source unit 'D:\SAP_Spartacus\SAP_2005\hybris\bin\modules\integration-apis\outboundservices\testsrc\de\hybris\platform\outboundservices\client\RestTemplateFactoryIntegrationTest.groovy' null at org.codehaus.groovy.control.CompilationUnit.applyToSourceUnits(CompilationUnit.java:980) at org.codehaus.groovy.control.CompilationUnit.doPhaseOperation(CompilationUnit.java:651) at org.codehaus.groovy.control.CompilationUnit.compile(CompilationUnit.java:600) at org.codehaus.groovy.control.CompilationUnit.compile(CompilationUnit.java:583) at

  • Is that the only error message you got? No errors / stacktrace before or after that? Also, what Java version are you using?

Assigned Tags

Related questions

2 Answers

  • Best Answer
    Posted on Jul 27, 2020 at 02:47 PM

    It has to do with the parameter : build.parallel in the custom.properties, if you set that to false it will work (but take a long time) , at least this fixed this issue for me.

    build.parallel=false

    Add a comment
    10|10000 characters needed characters exceeded

  • Posted on Jun 17, 2020 at 06:55 AM

    Hi Aniket Deshmukh,

    On hybris initialization there is a BUG! that stops the process. It has to do with groovy tests coming OOTB.

    Solution:

    Go to \hybris-commerce-suite-2005\hybris\bin\modules\platform\groovynature\buildcallbacks.xml and comment the following lines:

    Line 39, 41: Those load the testsrc and webtestsrc classes

    Line 68 to 70: groovy_compile for groovytestsrc, and finally

    Line 90 to 93: again groovy_compile for groovytestsrc

    Hope it helps

    Add a comment
    10|10000 characters needed characters exceeded

Before answering

You should only submit an answer when you are proposing a solution to the poster's problem. If you want the poster to clarify the question or provide more information, please leave a comment instead, requesting additional details. When answering, please include specifics, such as step-by-step instructions, context for the solution, and links to useful resources. Also, please make sure that you answer complies with our Rules of Engagement.
You must be Logged in to submit an answer.

Up to 10 attachments (including images) can be used with a maximum of 1.0 MB each and 10.5 MB total.